View Single Post
Old 16 July 2012, 11:38   #3
WCoder
Registered User
 
Join Date: Jul 2012
Location: France
Posts: 12
Thanks,

So i re-start from scratch but it's not better, is it possible to have your winuae dev directory on a zip ?

What i try :
I download source from : WinUAE sources (http://www.winuae.net/frames/download.html)
I download libs from : http://www.winuae.net/files/b/winuaeinclibs.zip

I unpack 2 archives in the same directory now include from 2 archive are mix and lib directory was added to root.

I open od-win32\winuae_msvc10\winuae_msvc.vcxproj with VC10 pro (I have a licence with my job)

I wait until intellisence finish parsing.

Build -> Rebuild solution

I save sln file in the same folder of project ...

Compilation start and failed :

1>------ Rebuild All started: Project: winuae, Configuration: Debug Win32 ------
1>C:\Program Files\MSBuild\Microsoft.Cpp\v4.0\Microsoft.CppBuild.targets(301,6): error MSB3191: Unable to create directory "d:\amiga\". The device is not ready.
1>C:\Program Files\MSBuild\Microsoft.Cpp\v4.0\Microsoft.CppBuild.targets(301,6): error MSB3191:
========== Rebuild All: 0 succeeded, 1 failed, 0 skipped ==========

I don't have d disk so i create an amiga directory on C and change Output Directory to c:\amiga\


Build -> Rebuild solution

Compilation start with a lot of error...

Close an save solution to ensure pdb release ...
Build -> Rebuild solution
Compilation start with a lot of error...
change Working directory on project by c:\amiga\
Remove edit and continue
delete debug output directory
Remove multi-processor compilation
Clean
rebuild

=> Pdb error remove but a lot of error persiste :

1>------ Build started: Project: winuae, Configuration: Debug Win32 ------
1> pfile.cpp
1>c:\Program Files\Microsoft Visual Studio 10.0\VC\include\iosfwd(19): error C2146: syntax error : missing ';' before identifier 'streamoff'
1>c:\Program Files\Microsoft Visual Studio 10.0\VC\include\iosfwd(19): error C4430: missing type specifier - int assumed. Note: C++ does not support default-int
1>c:\Program Files\Microsoft Visual Studio 10.0\VC\include\iosfwd(19): error C4430: missing type specifier - int assumed. Note: C++ does not support default-int
1>c:\Program Files\Microsoft Visual Studio 10.0\VC\include\iosfwd(28): error C2143: syntax error : missing ';' before 'const'
1>c:\Program Files\Microsoft Visual Studio 10.0\VC\include\iosfwd(28): error C4430: missing type specifier - int assumed. Note: C++ does not support default-int
1>c:\Program Files\Microsoft Visual Studio 10.0\VC\include\iosfwd(28): error C4430: missing type specifier - int assumed. Note: C++ does not support default-int
1>c:\Program Files\Microsoft Visual Studio 10.0\VC\include\iosfwd(28): error C2146: syntax error : missing ';' before identifier '_BADOFF'
1>c:\Program Files\Microsoft Visual Studio 10.0\VC\include\iosfwd(28): error C2373: 'std::streamoff' : redefinition; different type modifiers
1> c:\Program Files\Microsoft Visual Studio 10.0\VC\include\iosfwd(19) : see declaration of 'std::streamoff'
1>c:\Program Files\Microsoft Visual Studio 10.0\VC\include\iosfwd(28): error C4430: missing type specifier - int assumed. Note: C++ does not support default-int
1>c:\Program Files\Microsoft Visual Studio 10.0\VC\include\iosfwd(38): error C2061: syntax error : identifier 'streamoff'
1> c:\Program Files\Microsoft Visual Studio 10.0\VC\include\iosfwd(117) : see reference to class template instantiation 'std::fpos<_Statetype>' being compiled
1>c:\Program Files\Microsoft Visual Studio 10.0\VC\include\iosfwd(63): error C2833: 'operator streamoff' is not a recognized operator or type
1>c:\Program Files\Microsoft Visual Studio 10.0\VC\include\iosfwd(63): error C2059: syntax error : 'newline'
1>c:\Program Files\Microsoft Visual Studio 10.0\VC\include\iosfwd(64): error C2334: unexpected token(s) preceding '{'; skipping apparent function body
1>c:\Program Files\Microsoft Visual Studio 10.0\VC\include\iosfwd(68): error C2143: syntax error : missing ';' before '-'
1>c:\Program Files\Microsoft Visual Studio 10.0\VC\include\iosfwd(68): error C4430: missing type specifier - int assumed. Note: C++ does not support default-int
1>c:\Program Files\Microsoft Visual Studio 10.0\VC\include\iosfwd(69): error C4430: missing type specifier - int assumed. Note: C++ does not support default-int
1>c:\Program Files\Microsoft Visual Studio 10.0\VC\include\iosfwd(73): error C2061: syntax error : identifier 'streamoff'
1>c:\Program Files\Microsoft Visual Studio 10.0\VC\include\iosfwd(74): error C2805: binary 'operator +=' has too few parameters
1>c:\Program Files\Microsoft Visual Studio 10.0\VC\include\iosfwd(74): error C2333: 'std::fpos<_Statetype>:perator +=' : error in function declaration; skipping function body
1>c:\Program Files\Microsoft Visual Studio 10.0\VC\include\iosfwd(79): error C2061: syntax error : identifier 'streamoff'
1>c:\Program Files\Microsoft Visual Studio 10.0\VC\include\iosfwd(80): error C2805: binary 'operator -=' has too few parameters
1>c:\Program Files\Microsoft Visual Studio 10.0\VC\include\iosfwd(80): error C2333: 'std::fpos<_Statetype>:perator -=' : error in function declaration; skipping function body
1>c:\Program Files\Microsoft Visual Studio 10.0\VC\include\iosfwd(85): error C2061: syntax error : identifier 'streamoff'
1>c:\Program Files\Microsoft Visual Studio 10.0\VC\include\iosfwd(91): error C2061: syntax error : identifier 'streamoff'
1>c:\Program Files\Microsoft Visual Studio 10.0\VC\include\iosfwd(102): error C2061: syntax error : identifier 'streamoff'
1>c:\Program Files\Microsoft Visual Studio 10.0\VC\include\iosfwd(103): error C2805: binary 'operator ==' has too few parameters
1>c:\Program Files\Microsoft Visual Studio 10.0\VC\include\iosfwd(103): error C2333: 'std::fpos<_Statetype>:perator ==' : error in function declaration; skipping function body
1>c:\Program Files\Microsoft Visual Studio 10.0\VC\include\iosfwd(114): error C2146: syntax error : missing ';' before identifier '_Myoff'
1>c:\Program Files\Microsoft Visual Studio 10.0\VC\include\iosfwd(114): error C4430: missing type specifier - int assumed. Note: C++ does not support default-int
1>c:\Program Files\Microsoft Visual Studio 10.0\VC\include\iosfwd(114): error C4430: missing type specifier - int assumed. Note: C++ does not support default-int
1>c:\Program Files\Microsoft Visual Studio 10.0\VC\include\iosfwd(140): error C2146: syntax error : missing ';' before identifier 'off_type'
1> c:\Program Files\Microsoft Visual Studio 10.0\VC\include\iosfwd(253) : see reference to class template instantiation 'std::_Char_traits<_Elem,_Int_type>' being compiled
1>c:\Program Files\Microsoft Visual Studio 10.0\VC\include\iosfwd(140): error C4430: missing type specifier - int assumed. Note: C++ does not support default-int
1>c:\Program Files\Microsoft Visual Studio 10.0\VC\include\iosfwd(140): error C4430: missing type specifier - int assumed. Note: C++ does not support default-int
1>c:\Program Files\Microsoft Visual Studio 10.0\VC\include\iosfwd(144): error C2061: syntax error : identifier '_In_count_'
1>c:\Program Files\Microsoft Visual Studio 10.0\VC\include\iosfwd(145): error C2059: syntax error : ')'
1>c:\Program Files\Microsoft Visual Studio 10.0\VC\include\iosfwd(146): error C2143: syntax error : missing ')' before '{'
1>c:\Program Files\Microsoft Visual Studio 10.0\VC\include\iosfwd(153): error C2061: syntax error : identifier '_In_z_'
1>c:\Program Files\Microsoft Visual Studio 10.0\VC\include\iosfwd(162): error C2061: syntax error : identifier '_Out_cap_'
1>c:\Program Files\Microsoft Visual Studio 10.0\VC\include\iosfwd(163): error C2059: syntax error : ')'
1>c:\Program Files\Microsoft Visual Studio 10.0\VC\include\iosfwd(164): error C2143: syntax error : missing ')' before '{'
1>c:\Program Files\Microsoft Visual Studio 10.0\VC\include\iosfwd(172): error C2061: syntax error : identifier '_Out_cap_'
1>c:\Program Files\Microsoft Visual Studio 10.0\VC\include\iosfwd(173): error C2059: syntax error : ')'
1>c:\Program Files\Microsoft Visual Studio 10.0\VC\include\iosfwd(174): error C2143: syntax error : missing ')' before '{'
1>c:\Program Files\Microsoft Visual Studio 10.0\VC\include\iosfwd(180): error C2061: syntax error : identifier '_In_count_'
1>c:\Program Files\Microsoft Visual Studio 10.0\VC\include\iosfwd(181): error C2059: syntax error : ')'
1>c:\Program Files\Microsoft Visual Studio 10.0\VC\include\iosfwd(182): error C2143: syntax error : missing ')' before '{'
1>c:\Program Files\Microsoft Visual Studio 10.0\VC\include\iosfwd(190): error C2061: syntax error : identifier '_Out_cap_'
1>c:\Program Files\Microsoft Visual Studio 10.0\VC\include\iosfwd(191): error C2059: syntax error : ')'
1>c:\Program Files\Microsoft Visual Studio 10.0\VC\include\iosfwd(192): error C2143: syntax error : missing ')' before '{'
1>c:\Program Files\Microsoft Visual Studio 10.0\VC\include\iosfwd(204): error C2061: syntax error : identifier '_Out_cap_'
1>c:\Program Files\Microsoft Visual Studio 10.0\VC\include\iosfwd(205): error C2059: syntax error : ')'
1>c:\Program Files\Microsoft Visual Studio 10.0\VC\include\iosfwd(206): error C2143: syntax error : missing ')' before '{'
1>c:\Program Files\Microsoft Visual Studio 10.0\VC\include\iosfwd(286): error C2146: syntax error : missing ';' before identifier 'off_type'
1>c:\Program Files\Microsoft Visual Studio 10.0\VC\include\iosfwd(286): error C4430: missing type specifier - int assumed. Note: C++ does not support default-int
1>c:\Program Files\Microsoft Visual Studio 10.0\VC\include\iosfwd(286): error C4430: missing type specifier - int assumed. Note: C++ does not support default-int
1>c:\Program Files\Microsoft Visual Studio 10.0\VC\include\iosfwd(307): error C2061: syntax error : identifier '_Out_cap_'
1>c:\Program Files\Microsoft Visual Studio 10.0\VC\include\iosfwd(308): error C2059: syntax error : ')'
1>c:\Program Files\Microsoft Visual Studio 10.0\VC\include\iosfwd(309): error C2143: syntax error : missing ')' before '{'
1>c:\Program Files\Microsoft Visual Studio 10.0\VC\include\iosfwd(292): error C2065: '_CSTD' : undeclared identifier
1>c:\Program Files\Microsoft Visual Studio 10.0\VC\include\iosfwd(292): error C2146: syntax error : missing ')' before identifier 'wmemcmp'
1>c:\Program Files\Microsoft Visual Studio 10.0\VC\include\iosfwd(292): error C2059: syntax error : ')'
1>c:\Program Files\Microsoft Visual Studio 10.0\VC\include\iosfwd(297): error C2065: '_CSTD' : undeclared identifier
1>c:\Program Files\Microsoft Visual Studio 10.0\VC\include\iosfwd(297): error C2146: syntax error : missing ')' before identifier 'wcslen'
1>c:\Program Files\Microsoft Visual Studio 10.0\VC\include\iosfwd(297): error C2059: syntax error : ')'
1>c:\Program Files\Microsoft Visual Studio 10.0\VC\include\iosfwd(303): error C2065: '_CSTD' : undeclared identifier
1>c:\Program Files\Microsoft Visual Studio 10.0\VC\include\iosfwd(303): error C2146: syntax error : missing ')' before identifier 'wmemcpy'
1>c:\Program Files\Microsoft Visual Studio 10.0\VC\include\iosfwd(303): error C2059: syntax error : ')'
1>c:\Program Files\Microsoft Visual Studio 10.0\VC\include\iosfwd(310): error C2065: '_First1' : undeclared identifier
1>c:\Program Files\Microsoft Visual Studio 10.0\VC\include\iosfwd(310): error C2065: '_Size_in_words' : undeclared identifier
1>c:\Program Files\Microsoft Visual Studio 10.0\VC\include\iosfwd(310): error C2065: '_First2' : undeclared identifier
1>c:\Program Files\Microsoft Visual Studio 10.0\VC\include\iosfwd(310): error C2065: '_Count' : undeclared identifier
1>c:\Program Files\Microsoft Visual Studio 10.0\VC\include\iosfwd(310): error C3861: '_CRT_SECURE_WMEMCPY': identifier not found
1>c:\Program Files\Microsoft Visual Studio 10.0\VC\include\iosfwd(311): error C2065: '_First1' : undeclared identifier
1>c:\Program Files\Microsoft Visual Studio 10.0\VC\include\iosfwd(317): error C2065: '_CSTD' : undeclared identifier
1>c:\Program Files\Microsoft Visual Studio 10.0\VC\include\iosfwd(317): error C2146: syntax error : missing ')' before identifier 'wmemchr'
1>c:\Program Files\Microsoft Visual Studio 10.0\VC\include\iosfwd(317): error C2059: syntax error : ')'
.....
WCoder is offline  
 
Page generated in 0.08143 seconds with 9 queries